Reaction Details
TargetAcetyl-CoA carboxylase 2 [27-2458]
LigandBDBM220140
Substrate/Competitorn/a
Meas. Tech.Human ACC2 Enzyme Assay
pH7.5±n/a
Temperature295.15±n/a K
IC50 3390±n/a nM
Commentsextracted
Citation Liu, NThede, KMönning, UScholz, AHilger, CBömer, UFischer, R Substituted 3-(biphenyl-3-yl)-4-hydroxy-8-methoxy-1-azaspiro[4.5]dec-3-en-2-one US Patent US9278925 Publication Date 3/8/2016
 
Acetyl-CoA carboxylase 2 [27-2458]
Name:Acetyl-CoA carboxylase 2 [27-2458]
Type:Protein
Mol. Mass.:273501.32
Organism:Homo sapiens (Human)
Description:amino acids 27-end
Residue:2432
BDBM220140
NameBDBM220140
Synonyms:US9278925, 1-1
TypeSmall organic molecule
Emp. Form.C24H23ClF3NO3
Mol. Mass.465.893
SMILESCO[C@]1(CC[C@@]2(CC1)NC(=O)C(=C2O)c1cc(ccc1C)-c1ccc(Cl)cc1)C(F)(F)F