Reaction Details
TargetAcetyl-CoA carboxylase 2 [27-2458]
LigandBDBM220131
Substrate/Competitorn/a
Meas. Tech.Human ACC2 Enzyme Assay
pH7.5±n/a
Temperature295.15±n/a K
IC50 1220±n/a nM
Commentsextracted
Citation Liu, NThede, KMönning, UScholz, AHilger, CBömer, UFischer, R Substituted 3-(biphenyl-3-yl)-4-hydroxy-8-methoxy-1-azaspiro[4.5]dec-3-en-2-one US Patent US9278925 Publication Date 3/8/2016
 
Acetyl-CoA carboxylase 2 [27-2458]
Name:Acetyl-CoA carboxylase 2 [27-2458]
Type:Protein
Mol. Mass.:273501.32
Organism:Homo sapiens (Human)
Description:amino acids 27-end
Residue:2432
BDBM220131
NameBDBM220131
Synonyms:US9278925, V.1-b
TypeSmall organic molecule
Emp. Form.C23H21ClF3NO2
Mol. Mass.435.867
SMILESCc1ccc(cc1C1=C(O)[C@]2(CC[C@@H](CC2)C(F)(F)F)NC1=O)-c1ccc(Cl)cc1