Reaction Details
TargetC-X-C chemokine receptor type 4
LigandBDBM221860
Substrate/Competitorn/a
Meas. Tech.Calcium Mobilization Assay
Temperature310.15±n/a K
IC50 1±n/a nM
Commentsextracted
Citation Clark, MPWagner, FFNatchus, MGDoroh, BCJohnson, TLTahirovic, YAWilson, LWiseman, JMSkudlarek, JWLockwood, MA Chemokine receptor modulators US Patent US9314468 Publication Date 4/19/2016
 
C-X-C chemokine receptor type 4
Name:C-X-C chemokine receptor type 4
Type:Enzyme
Mol. Mass.:39754.61
Organism:Homo sapiens (Human)
Description:P61073
Residue:352
BDBM221860
NameBDBM221860
Synonyms:US9314468, Table 7, Compound 147
TypeSmall organic molecule
Emp. Form.C35H46N6O
Mol. Mass.566.7793
SMILESC(CN(Cc1nccc2c3ccccc3n(CCC3CCOCC3)c12)[C@H]1CCCc2cccnc12)CN1CCNCC1