Reaction Details
TargetSphingosine 1-phosphate receptor 1
LigandBDBM221913
Substrate/Competitorn/a
Meas. Tech.β-Arrestin Assay
Temperature298.15±n/a K
EC50 77±n/a nM
Commentsextracted
Citation Zhang, XWang, EGuo, JNiu, SDai, ZZheng, NJi, LWang, ZLiang, T Heterocyclic group contained amino-methanol derivative, and salt, synthetic method and use thereof US Patent US9315492 Publication Date 4/19/2016
 
Sphingosine 1-phosphate receptor 1
Name:Sphingosine 1-phosphate receptor 1
Type:Enzyme
Mol. Mass.:42663.66
Organism:Mus musculus (Mouse)
Description:O08530
Residue:382
BDBM221913
NameBDBM221913
Synonyms:US9315492, 10
TypeSmall organic molecule
Emp. Form.C22H25N3O4
Mol. Mass.395.4516
SMILESCOCCOc1ccc(cc1)-c1nnc(o1)-c1ccc2CCC(N)(CO)Cc2c1