Reaction Details
TargetSphingosine 1-phosphate receptor 1
LigandBDBM221914
Substrate/Competitorn/a
Meas. Tech.β-Arrestin Assay
Temperature298.15±n/a K
EC50 3.1±n/a nM
Commentsextracted
Citation Zhang, XWang, EGuo, JNiu, SDai, ZZheng, NJi, LWang, ZLiang, T Heterocyclic group contained amino-methanol derivative, and salt, synthetic method and use thereof US Patent US9315492 Publication Date 4/19/2016
 
Sphingosine 1-phosphate receptor 1
Name:Sphingosine 1-phosphate receptor 1
Type:Enzyme
Mol. Mass.:42663.66
Organism:Mus musculus (Mouse)
Description:O08530
Residue:382
BDBM221914
NameBDBM221914
Synonyms:US9315492, 11
TypeSmall organic molecule
Emp. Form.C23H24F3N3O3
Mol. Mass.447.4502
SMILESCC(C)Oc1ccc(cc1C(F)(F)F)-c1nnc(o1)-c1ccc2CCC(N)(CO)Cc2c1