Reaction Details
TargetSphingosine 1-phosphate receptor 1
LigandBDBM221929
Substrate/Competitorn/a
Meas. Tech.β-Arrestin Assay
Temperature298.15±n/a K
EC50 14.3±n/a nM
Commentsextracted
Citation Zhang, XWang, EGuo, JNiu, SDai, ZZheng, NJi, LWang, ZLiang, T Heterocyclic group contained amino-methanol derivative, and salt, synthetic method and use thereof US Patent US9315492 Publication Date 4/19/2016
 
Sphingosine 1-phosphate receptor 1
Name:Sphingosine 1-phosphate receptor 1
Type:Enzyme
Mol. Mass.:42663.66
Organism:Mus musculus (Mouse)
Description:O08530
Residue:382
BDBM221929
NameBDBM221929
Synonyms:US9315492, 31 | US9315492, 32
TypeSmall organic molecule
Emp. Form.C23H28N4O2
Mol. Mass.392.494
SMILESCC(C)Oc1ccc(cc1C)-c1cn(nn1)-c1ccc2CC(N)(CO)CCc2c1