Reaction Details
TargetIntestinal-type alkaline phosphatase
LigandBDBM18073
Substrate/Competitorn/a
Meas. Tech.Alkaline Phosphatase Assay
pH9.8±n/a
Temperature310.15±n/a K
IC50 8.02e+4± 1 nM
Commentsextracted
Citation Ejaz, SASaeed, ASiddique, MNNisa, ZUKhan, SLecka, JSévigny, JIqbal, J Synthesis, characterization and biological evaluation of novel chalcone sulfonamide hybrids as potent intestinal alkaline phosphatase inhibitors. Bioorg Chem70:229-236 (2017) 
 
Intestinal-type alkaline phosphatase
Name:Intestinal-type alkaline phosphatase
Type:Protein
Mol. Mass.:57094.82
Organism:Bos taurus (Cattle)
Description:P19111
Residue:533
BDBM18073
NameBDBM18073
Synonyms:(2S)-2-amino-3-phenylpropanoic acid L-[2,3,4,5,6-3H]phenylalanine Phenylalanine | US11021454, Compound L-phe
TypeAmino Acid
Emp. Form.C9H11NO2
Mol. Mass.165.1891
SMILESN[C@@H](Cc1ccccc1)C(O)=O