Reaction Details
TargetTranscription factor SOX-18
LigandBDBM17636
Substrate/Competitorn/a
Meas. Tech.Fluorescence Polarization Assay
pH7.5±n/a
Temperature310.15±n/a K
IC50 2.20e+5± 6.86e+4 nM
Commentsextracted
Citation Fontaine, FOverman, JMoustaqil, MMamidyala, SSalim, ANarasimhan, KProkoph, NRobertson, AALua, LAlexandrov, KKoopman, PCapon, RJSierecki, EGambin, YJauch, RCooper, MAZuegg, JFrancois, M Small-Molecule Inhibitors of the SOX18 Transcription Factor. Cell Chem Biol24:346-359 (2017) 
 
Transcription factor SOX-18
Name:Transcription factor SOX-18
Type:Protein
Mol. Mass.:40900.72
Organism:Mus musculus (Mouse)
Description:P43680
Residue:377
BDBM17636
NameBDBM17636
Synonyms:2-{[3-(trifluoromethyl)phenyl]amino}benzoic acid CHEMBL23588 Nichisedan US9271961, Flufenamic Acid
TypeSmall organic molecule
Emp. Form.C14H10F3NO2
Mol. Mass.281.2299
SMILESOC(=O)c1ccccc1Nc1cccc(c1)C(F)(F)F