Reaction Details
TargetPotassium voltage-gated channel subfamily H member 2
LigandBDBM223358
Substrate/Competitorn/a
Meas. Tech.hERG Patch Clamp Assay
Temperature310.15±n/a K
IC50 200±n/a nM
Commentsextracted
Citation Brodney, MABeck, EMButler, CRZhang, LO'Neill, BTBarreiro, GLaChapelle, EARogers, BN 2-amino-6-methyl-4,4a,5,6-tetrahydropyrano[3,4-d][1,3]thiazin-8a(8H)-yl-1,3-thiazol-4-yl amides US Patent US9315520 Publication Date 4/19/2016
 
Potassium voltage-gated channel subfamily H member 2
Name:Potassium voltage-gated channel subfamily H member 2
Type:Multi-pass membrane protein
Mol. Mass.:126672.65
Organism:Homo sapiens (Human)
Description:Q12809
Residue:1159
BDBM223358
NameBDBM223358
Synonyms:US9315520, Comparator 7 US9744173, Comparator 7
TypeSmall organic molecule
Emp. Form.C20H20ClFN4O2S
Mol. Mass.434.915
SMILES[H][C@]12CSC(N)=N[C@]1(CO[C@@H](C)C2)c1cc(NC(=O)c2ccc(Cl)cn2)ccc1F