Reaction Details
TargetMas-related G-protein coupled receptor member X2
LigandBDBM224023
Substrate/Competitorn/a
Meas. Tech.Intracellular Calcium Mobilization Assay
pH7.4±0
Temperature303.15±0 K
EC50 3.9e+3±1.7e+3 nM
Citation Lansu, KKarpiak, JLiu, JHuang, XPMcCorvy, JDKroeze, WKChe, TNagase, HCarroll, FIJin, JShoichet, BKRoth, BL In silico design of novel probes for the atypical opioid receptor MRGPRX2. Nat Chem Biol13:529-536 (2017) 
 
Mas-related G-protein coupled receptor member X2
Name:Mas-related G-protein coupled receptor member X2
Type:GPCR
Mol. Mass.:37104.79
Organism:Homo sapiens (Human)
Description:Q96LB1
Residue:330
BDBM224023
NameBDBM224023
Synonyms:Dextrorphan
TypeSmall organic molecule
Emp. Form.C17H23NO
Mol. Mass.257.3706
SMILESCN1CC[C@]23CCCC[C@@H]2[C@H]1Cc1ccc(O)cc31