Reaction Details
TargetMas-related G-protein coupled receptor member X2
LigandBDBM224031
Substrate/Competitorn/a
Meas. Tech.Intracellular Calcium Mobilization Assay
pH7.4±0
Temperature303.15±0 K
EC50 4.0e+3±1.7e+3 nM
Citation Lansu, KKarpiak, JLiu, JHuang, XPMcCorvy, JDKroeze, WKChe, TNagase, HCarroll, FIJin, JShoichet, BKRoth, BL In silico design of novel probes for the atypical opioid receptor MRGPRX2. Nat Chem Biol13:529-536 (2017) 
 
Mas-related G-protein coupled receptor member X2
Name:Mas-related G-protein coupled receptor member X2
Type:GPCR
Mol. Mass.:37104.79
Organism:Homo sapiens (Human)
Description:Q96LB1
Residue:330
BDBM224031
NameBDBM224031
Synonyms:Sinomenine
TypeSmall organic molecule
Emp. Form.C19H23NO4
Mol. Mass.329.3902
SMILES[H][C@]12Cc3ccc(OC)c(O)c3[C@@]3(CCN1C)CC(=O)C(OC)=C[C@]23[H]