Reaction Details
TargetMas-related G-protein coupled receptor member X2
LigandBDBM224025
Substrate/Competitorn/a
Meas. Tech.PRESTO-Tango Assay
pH7.4±0
Temperature303.15±0 K
EC50 2.1e+4±2.4e+4 nM
Citation Lansu, KKarpiak, JLiu, JHuang, XPMcCorvy, JDKroeze, WKChe, TNagase, HCarroll, FIJin, JShoichet, BKRoth, BL In silico design of novel probes for the atypical opioid receptor MRGPRX2. Nat Chem Biol13:529-536 (2017) 
 
Mas-related G-protein coupled receptor member X2
Name:Mas-related G-protein coupled receptor member X2
Type:GPCR
Mol. Mass.:37104.79
Organism:Homo sapiens (Human)
Description:Q96LB1
Residue:330
BDBM224025
NameBDBM224025
Synonyms:Dynorphin A (1-17) | YGGFLRRXRPKLKWDNQ
TypeSmall organic molecule
Emp. Form.C99H155N31O23
Mol. Mass.2147.4839
SMILESCCC(C)C(NC(=O)C(CCCNC(N)=N)NC(=O)C(CCCNC(N)=N)NC(=O)C(CC(C)C)NC(=O)C(Cc1ccccc1)NC(=O)CNC(=O)CNC(=O)C(N)Cc1ccc(O)cc1)C(=O)NC(CCCNC(N)=N)C(=O)N1CCCC1C(=O)NC(CCCCN)C(=O)NC(CC(C)C)C(=O)NC(CCCCN)C(=O)NC(Cc1c[nH]c2ccccc12)C(=O)NC(CC(O)=O)C(=O)NC(CC(N)=O)C(=O)NC(CCC(N)=O)C(O)=O