Reaction Details
TargetTyrosine-protein kinase BTK
LigandBDBM225237
Substrate/Competitorn/a
Meas. Tech.BTK FRET Competitive Binding Assay
Temperature303.15±n/a K
IC50 2.1e+2±n/a nM
Commentsextracted
Citation Cuozzo, JWCentrella, PAGikunju, DHabeshian, SHupp, CDKeefe, ADSigel, EASoutter, HHThomson, HAZhang, YClark, MA Discovery of a Potent BTK Inhibitor with a Novel Binding Mode by Using Parallel Selections with a DNA-Encoded Chemical Library. Chembiochem18:864-871 (2017) 
 
Tyrosine-protein kinase BTK
Name:Tyrosine-protein kinase BTK
Type:Enzyme
Mol. Mass.:76289.95
Organism:Homo sapiens (Human)
Description:Q06187
Residue:659
BDBM225237
NameBDBM225237
Synonyms:BTK inhibitor, 2
TypeSmall organic molecule
Emp. Form.C27H27N5O3
Mol. Mass.469.535
SMILESCNC(=O)Cc1cccc(NC(=O)c2n[nH]cc2CNc2ccccc2[C@H](O)c2ccccc2)c1