Reaction Details
TargetTyrosine-protein phosphatase non-receptor type 1
LigandBDBM226153
Substrate/Competitorp-Nitrophenyl phosphate (p-NPP)
Meas. Tech.PTP1B Assay
pH6±0
Temperature310.15±0 K
Ki 9.7e+3± 1e+2 nM
IC50 1.38e+4± 2e+2 nM
Citation Le, DDNguyen, DHZhao, BTSeong, SHChoi, JSKim, SKKim, JAMin, BSWoo, MH PTP1B inhibitors from Selaginella tamariscina (Beauv.) Spring and their kinetic properties and molecular docking simulation Bioorg Chem72:273-281 (2017)  
 
Tyrosine-protein phosphatase non-receptor type 1
Name:Tyrosine-protein phosphatase non-receptor type 1
Type:Protein phosphatase
Mol. Mass.:49963.76
Organism:Homo sapiens (Human)
Description:Human recombinant GST-fusion PTP1B (1-435).
Residue:435
BDBM226153
p-Nitrophenyl phosphate (p-NPP)
NameBDBM226153
Synonyms:Selaginellin U (2)
TypeSmall organic molecule
Emp. Form.C34H24O4
Mol. Mass.496.552
SMILES[#6]-c1ccc(-c2ccc(-[#8])cc2)c(\[#6](=[#6]-2\[#6]=[#6]-[#6](=O)-[#6]=[#6]-2)-c2ccc(-[#8])cc2)c1C#Cc1ccc(-[#8])cc1