Reaction Details
TargetTyrosine-protein phosphatase non-receptor type 1
LigandBDBM226177
Substrate/Competitorn/a
Meas. Tech.PTP1B Inhibitory Assay
pH6±n/a
IC50 17030±90 nM
Commentsextracted
Citation Nguyen, DHSeo, UMZhao, BTLe, DDSeong, SHChoi, JSMin, BSWoo, MH Ellagitannin and flavonoid constituents from Agrimonia pilosa Ledeb. with their protein tyrosine phosphatase and acetylcholinesterase inhibitory activities Bioorg Chem72:293-300 (2017)  
 
Tyrosine-protein phosphatase non-receptor type 1
Name:Tyrosine-protein phosphatase non-receptor type 1
Type:Protein phosphatase
Mol. Mass.:49963.76
Organism:Homo sapiens (Human)
Description:Human recombinant GST-fusion PTP1B (1-435).
Residue:435
BDBM226177
NameBDBM226177
Synonyms:Agritannin (1)
TypeSmall organic molecule
Emp. Form.C27H22O18
Mol. Mass.634.4528
SMILESOCC1O[C@H](OC(=O)c2cc(O)c(O)c(O)c2)C2OC(=O)c3cc(O)c(O)c(c3O)-c3c(O)c(O)cc(c3O)C(=O)O[C@H]2[C@@H]1O