Reaction Details
TargetTyrosine-protein phosphatase non-receptor type 1
LigandBDBM226178
Substrate/Competitorn/a
Meas. Tech.PTP1B Inhibitory Assay
pH6±n/a
IC50 100000±n/a nM
Commentsextracted
Citation Nguyen, DHSeo, UMZhao, BTLe, DDSeong, SHChoi, JSMin, BSWoo, MH Ellagitannin and flavonoid constituents from Agrimonia pilosa Ledeb. with their protein tyrosine phosphatase and acetylcholinesterase inhibitory activities Bioorg Chem72:293-300 (2017)  
 
Tyrosine-protein phosphatase non-receptor type 1
Name:Tyrosine-protein phosphatase non-receptor type 1
Type:Protein phosphatase
Mol. Mass.:49963.76
Organism:Homo sapiens (Human)
Description:Human recombinant GST-fusion PTP1B (1-435).
Residue:435
BDBM226178
NameBDBM226178
Synonyms:Agriflavone (2)
TypeSmall organic molecule
Emp. Form.C27H28O15
Mol. Mass.592.5022
SMILESCOC(=O)[C@H]1O[C@@H](Oc2cc(O)c3c(c2)oc(cc3=O)-c2ccc(O)cc2)C(O[C@@H]2OC(CO)[C@@H](O)C(O)[C@@H]2O)[C@H]1O