Reaction Details
TargetAcetylcholinesterase
LigandBDBM50241345
Substrate/Competitorn/a
Meas. Tech.Acetylcholinesterase Inhibitory Assay
pH8±n/a
Temperature298.15±n/a K
IC50 62960±350 nM
Commentsextracted
Citation Nguyen, DHSeo, UMZhao, BTLe, DDSeong, SHChoi, JSMin, BSWoo, MH Ellagitannin and flavonoid constituents from Agrimonia pilosa Ledeb. with their protein tyrosine phosphatase and acetylcholinesterase inhibitory activities Bioorg Chem72:293-300 (2017)  
 
Acetylcholinesterase
Name:Acetylcholinesterase
Type:Enzyme
Mol. Mass.:67792.70
Organism:Homo sapiens (Human)
Description:P22303
Residue:614
BDBM50241345
NameBDBM50241345
Synonyms:Apigenin 7-O-β-D-glucuronide (9) apigenin-7-O-beta-D-glucuronide | apigenin-7-O-betaD-glucuronic acid
TypeSmall organic molecule
Emp. Form.C21H18O11
Mol. Mass.446.361
SMILESO[C@H]1[C@H](Oc2cc(O)c3c(c2)oc(cc3=O)-c2ccc(O)cc2)O[C@@H]([C@@H](O)[C@@H]1O)C(O)=O