Reaction Details
TargetAcetylcholinesterase
LigandBDBM226183
Substrate/Competitorn/a
Meas. Tech.Acetylcholinesterase Inhibitory Assay
pH8±n/a
Temperature298.15±n/a K
IC50 89210±2690 nM
Commentsextracted
Citation Nguyen, DHSeo, UMZhao, BTLe, DDSeong, SHChoi, JSMin, BSWoo, MH Ellagitannin and flavonoid constituents from Agrimonia pilosa Ledeb. with their protein tyrosine phosphatase and acetylcholinesterase inhibitory activities Bioorg Chem72:293-300 (2017)  
 
Acetylcholinesterase
Name:Acetylcholinesterase
Type:Enzyme
Mol. Mass.:67792.70
Organism:Homo sapiens (Human)
Description:P22303
Residue:614
BDBM226183
NameBDBM226183
Synonyms:Quercetin 3'-O-β-D-glucoside (12)
TypeSmall organic molecule
Emp. Form.C21H20O12
Mol. Mass.464.3763
SMILESOC[C@H]1O[C@@H](Oc2cc(ccc2O)-c2oc3cc(O)cc(O)c3c(=O)c2O)[C@H](O)[C@@H](O)[C@@H]1O