Reaction Details
TargetAcetylcholinesterase
LigandBDBM50241242
Substrate/Competitorn/a
Meas. Tech.Acetylcholinesterase Inhibitory Assay
pH8±n/a
Temperature298.15±n/a K
IC50 74680±10.0 nM
Commentsextracted
Citation Nguyen, DHSeo, UMZhao, BTLe, DDSeong, SHChoi, JSMin, BSWoo, MH Ellagitannin and flavonoid constituents from Agrimonia pilosa Ledeb. with their protein tyrosine phosphatase and acetylcholinesterase inhibitory activities Bioorg Chem72:293-300 (2017)  
 
Acetylcholinesterase
Name:Acetylcholinesterase
Type:Enzyme
Mol. Mass.:67792.70
Organism:Homo sapiens (Human)
Description:P22303
Residue:614
BDBM50241242
NameBDBM50241242
Synonyms:2-(3,4-dihydroxyphenyl)-5-hydroxy-4-oxo-4H-chromen-7-yl beta-D-glucopyranoside 7-Glucoluteolin CHEMBL233929 Cynaroside Luteolin 7-O-glucopyranoside Luteolin 7-glucoside Luteolin-7-glucoside cid_5280637 | luteolin 7-O-beta-D-glucoside
TypeSmall organic molecule
Emp. Form.C21H20O11
Mol. Mass.448.3769
SMILESOC[C@H]1O[C@@H](Oc2cc(O)c3c(c2)oc(cc3=O)-c2ccc(O)c(O)c2)[C@H](O)[C@@H](O)[C@@H]1O