Reaction Details
TargetAcetylcholinesterase
LigandBDBM226185
Substrate/Competitorn/a
Meas. Tech.Acetylcholinesterase Inhibitory Assay
pH8±n/a
Temperature298.15±n/a K
IC50 65880±400 nM
Commentsextracted
Citation Nguyen, DHSeo, UMZhao, BTLe, DDSeong, SHChoi, JSMin, BSWoo, MH Ellagitannin and flavonoid constituents from Agrimonia pilosa Ledeb. with their protein tyrosine phosphatase and acetylcholinesterase inhibitory activities Bioorg Chem72:293-300 (2017)  
 
Acetylcholinesterase
Name:Acetylcholinesterase
Type:Enzyme
Mol. Mass.:67792.70
Organism:Homo sapiens (Human)
Description:P22303
Residue:614
BDBM226185
NameBDBM226185
Synonyms:Luteolin 7-O-β-D-glucuronide methyl ester (15)
TypeSmall organic molecule
Emp. Form.C22H20O13
Mol. Mass.492.3864
SMILESO[C@@H]1O[C@@H]([C@@H](O)[C@H](O)[C@H]1O)C(=O)OCOc1cc(O)c2c(c1)oc(cc2=O)-c1ccc(O)c(O)c1