Reaction Details
TargetHigh affinity nerve growth factor receptor [441-796]
LigandBDBM226992
Substrate/Competitorn/a
Meas. Tech.Cell Based Assay
Temperature310.15±n/a K
IC50 2.65±n/a nM
Commentsextracted
Citation Bagal, SKCui, JJGreasley, SELunney, EAMcAlpine, IJNagata, ANinkovic, SOmoto, KSkerratt, SEStorer, RIWarmus, JS Tropomyosin-related kinase inhibitors US Patent US9328096 Publication Date 5/3/2016
 
High affinity nerve growth factor receptor [441-796]
Name:High affinity nerve growth factor receptor [441-796]
Type:Protein
Mol. Mass.:39939.20
Organism:Homo sapiens (Human)
Description:Human his-tagged TrkA cytoplasmic domain (441-796 aa)
Residue:356
BDBM226992
NameBDBM226992
Synonyms:US9328096, 680
TypeSmall organic molecule
Emp. Form.C29H23ClFN7O2
Mol. Mass.555.99
SMILESCc1ccc(CNC(=O)c2cc(NC(=O)c3cc(c(F)cc3Cl)-c3ccccn3)n(n2)-c2ccccc2)c(N)n1