Reaction Details
TargetAcetylcholinesterase
LigandBDBM227586
Substrate/Competitorn/a
Meas. Tech.In Vitro AChE/BChE Inhibition Assay
pH7.4±n/a
Temperature298.15±n/a K
IC50 515.41±75.46 nM
Commentsextracted
Citation Czarnecka, KSzymanski, PGirek, MMikiciuk-Olasik, ESkibinski, RKabzinski, JMajsterek, IMalawska, BJonczyk, JBajda, M Tetrahydroacridine derivatives with fluorobenzoic acid moiety as multifunctional agents for Alzheimer's disease treatment. Bioorg Chem72:315-322 (2017) 
 
Acetylcholinesterase
Name:Acetylcholinesterase
Type:Enzyme
Mol. Mass.:71812.79
Organism:Electrophorus electricus (Electric eel)
Description:n/a
Residue:633
BDBM227586
NameBDBM227586
Synonyms:3-Fluoro-N-[3-(1,2,3,4-tetrahydroacridin-9-ylamino)propyl]benzamide hydrochloride (3e)
TypeSmall organic molecule
Emp. Form.C23H24FN3O
Mol. Mass.377.4546
SMILESFc1cccc(c1)C(=O)NCCCNc1c2CCCCc2nc2ccccc12