Reaction Details
TargetCarboxylic ester hydrolase
LigandBDBM227584
Substrate/Competitorn/a
Meas. Tech.In Vitro AChE/BChE Inhibition Assay
pH7.4±n/a
Temperature298.15±n/a K
IC50 1.39±0.17 nM
Commentsextracted
Citation Czarnecka, KSzymanski, PGirek, MMikiciuk-Olasik, ESkibinski, RKabzinski, JMajsterek, IMalawska, BJonczyk, JBajda, M Tetrahydroacridine derivatives with fluorobenzoic acid moiety as multifunctional agents for Alzheimer's disease treatment. Bioorg Chem72:315-322 (2017) 
 
Carboxylic ester hydrolase
Name:Carboxylic ester hydrolase
Type:Protein
Mol. Mass.:68842.83
Organism:Equus caballus (Horse)
Description:Q9N1N9
Residue:602
BDBM227584
NameBDBM227584
Synonyms:2-Fluoro-N-[4-(1,2,3,4-tetrahydroacridin-9-ylamino)butyl]benzamide hydrochloride (3c)
TypeSmall organic molecule
Emp. Form.C24H26FN3O
Mol. Mass.391.4811
SMILESFc1ccccc1C(=O)NCCCCNc1c2CCCCc2nc2ccccc12