Reaction Details
TargetCarboxylic ester hydrolase
LigandBDBM227585
Substrate/Competitorn/a
Meas. Tech.In Vitro AChE/BChE Inhibition Assay
pH7.4±n/a
Temperature298.15±n/a K
IC50 4.76±0.58 nM
Commentsextracted
Citation Czarnecka, KSzymanski, PGirek, MMikiciuk-Olasik, ESkibinski, RKabzinski, JMajsterek, IMalawska, BJonczyk, JBajda, M Tetrahydroacridine derivatives with fluorobenzoic acid moiety as multifunctional agents for Alzheimer's disease treatment. Bioorg Chem72:315-322 (2017) 
 
Carboxylic ester hydrolase
Name:Carboxylic ester hydrolase
Type:Protein
Mol. Mass.:68842.83
Organism:Equus caballus (Horse)
Description:Q9N1N9
Residue:602
BDBM227585
NameBDBM227585
Synonyms:3-Fluoro-N-[2-(1,2,3,4-tetrahydroacridin-9-ylamino)ethyl]benzamide hydrochloride (3d)
TypeSmall organic molecule
Emp. Form.C22H22FN3O
Mol. Mass.363.428
SMILESFc1cccc(c1)C(=O)NCCNc1c2CCCCc2nc2ccccc12