Reaction Details
TargetBone morphogenetic protein receptor type-1A
LigandBDBM111123
Substrate/Competitorn/a
Meas. Tech.ALK1-6 enzymatic assays
pH7.5±n/a
IC50 9.10±n/a nM
Commentsextracted
Citation Alimardanov, ACuny, GDGrewal, GSLee, AMcKew, JCMohedas, AHShen, MXu, XYu, PB BMP inhibitors and methods of use thereof US Patent US9682983 Publication Date 6/20/2017
 
Bone morphogenetic protein receptor type-1A
Name:Bone morphogenetic protein receptor type-1A
Type:Enzyme
Mol. Mass.:60204.46
Organism:Homo sapiens (Human)
Description:P36894
Residue:532
BDBM111123
NameBDBM111123
Synonyms:US10017516, Compound 2 | US9682983, 2
TypeSmall organic molecule
Emp. Form.C27H26N6
Mol. Mass.434.5355
SMILESC[C@H]1CNC[C@@H](C)N1c1ccc(cc1)-c1cnc2c(cnn2c1)-c1ccnc2ccccc12