Reaction Details
TargetInsulin receptor
LigandBDBM291987
Substrate/Competitorn/a
Meas. Tech.Inhibition of ALK IR Anaplastic Lymphoma Kinase Activity
IC50 2.60±n/a nM
Citation Kim, PKim, HRCho, SYHa, JDJung, HJYun, CSHwang, JYPark, CHLee, COAhn, SChae, CH N2-(2-methoxyphenyl)pyrimidine derivative, method for preparing same, and pharmaceutical composition for cancer prevention or treatment containing same as active ingredient US Patent US10100019 Publication Date 10/16/2018
 
Insulin receptor
Name:Insulin receptor
Type:Receptor Tyrosine Kinase
Mol. Mass.:156322.60
Organism:Homo sapiens (Human)
Description:P06213
Residue:1382
BDBM291987
NameBDBM291987
Synonyms:US10100019, Example 57
TypeSmall organic molecule
Emp. Form.C24H30ClN5O3S
Mol. Mass.504.045
SMILESCOc1cc(c(C)cc1Nc1ncc(Cl)c(Nc2ccccc2S(=O)(=O)C(C)C)n1)C(C)(C)N