Reaction Details
TargetInsulin receptor
LigandBDBM291994
Substrate/Competitorn/a
Meas. Tech.Inhibition of ALK IR Anaplastic Lymphoma Kinase Activity
IC50 1.90±n/a nM
Citation Kim, PKim, HRCho, SYHa, JDJung, HJYun, CSHwang, JYPark, CHLee, COAhn, SChae, CH N2-(2-methoxyphenyl)pyrimidine derivative, method for preparing same, and pharmaceutical composition for cancer prevention or treatment containing same as active ingredient US Patent US10100019 Publication Date 10/16/2018
 
Insulin receptor
Name:Insulin receptor
Type:Receptor Tyrosine Kinase
Mol. Mass.:156322.60
Organism:Homo sapiens (Human)
Description:P06213
Residue:1382
BDBM291994
NameBDBM291994
Synonyms:US10100019, Example 64
TypeSmall organic molecule
Emp. Form.C25H32ClN5O3S
Mol. Mass.518.071
SMILESCNC(C)(C)c1cc(OC)c(Nc2ncc(Cl)c(Nc3ccccc3S(=O)(=O)C(C)C)n2)cc1C