Reaction Details
TargetPoly [ADP-ribose] polymerase tankyrase-1 [1091-1325]
LigandBDBM231158
Substrate/Competitorn/a
Meas. Tech.Tankyrase Biochemical Assays
Temperature298.15±n/a K
IC50 0.375±n/a nM
Commentsextracted
Citation Bregman, HBuchanan, JLChakka, NDimauro, EFGunaydin, HGuzman-Perez, AHua, ZHuang, HHuang, XMartin, MWPatel, VF Oxazolidinone compounds and derivatives thereof US Patent US9340549 Publication Date 5/17/2016
 
Poly [ADP-ribose] polymerase tankyrase-1 [1091-1325]
Name:Poly [ADP-ribose] polymerase tankyrase-1 [1091-1325]
Type:Enzyme
Mol. Mass.:26714.90
Organism:Homo sapiens (Human)
Description:O95271[1091-1325]
Residue:235
BDBM231158
NameBDBM231158
Synonyms:US9340549, 178
TypeSmall organic molecule
Emp. Form.C24H24N4O3
Mol. Mass.416.4724
SMILESC[C@H]1OC(=O)N([C@H]1c1ccccc1)[C@H]1CC[C@@H](CC1)n1c2ccc(cc2[nH]c1=O)C#N