Reaction Details
TargetApoptosis regulator Bcl-2
LigandBDBM50384339
Substrate/Competitorn/a
Meas. Tech.Fluorescence Polarization Assay (FPA)
Temperature298.15±n/a K
IC50 5.09±n/a nM
Commentsextracted
Citation Borzilleri, RMCai, ZTebben, AJPerez, HLZhang, LSchroeder, GMWei, DD Substituted sulfonamides useful as antiapoptotic Bcl inhibitors US Patent US9346795 Publication Date 5/24/2016
 
Apoptosis regulator Bcl-2
Name:Apoptosis regulator Bcl-2
Type:Homodimer or heterodimer
Mol. Mass.:26269.11
Organism:Homo sapiens (Human)
Description:P10415
Residue:239
BDBM50384339
NameBDBM50384339
Synonyms:CHEMBL2031008 | US9346795, 329
TypeSmall organic molecule
Emp. Form.C38H38Cl2N6O4S
Mol. Mass.745.717
SMILESCCCN(CCC)c1ncc(Cl)c(n1)-c1ccc(cc1C(=O)N1Cc2ccccc2C[C@H]1CN)C(=O)NS(=O)(=O)c1ccc2cccc(Cl)c2c1