Reaction Details
TargetBcl-2-like protein 1
LigandBDBM50384339
Substrate/Competitorn/a
Meas. Tech.Fluorescence Resonance Energy Transfer Assay (FRET)
Temperature298.15±n/a K
IC50 20±n/a nM
Commentsextracted
Citation Borzilleri, RMCai, ZTebben, AJPerez, HLZhang, LSchroeder, GMWei, DD Substituted sulfonamides useful as antiapoptotic Bcl inhibitors US Patent US9346795 Publication Date 5/24/2016
 
Bcl-2-like protein 1
Name:Bcl-2-like protein 1
Type:Mitochondrion membrane; Single-pass membrane protein
Mol. Mass.:26039.60
Organism:Homo sapiens (Human)
Description:n/a
Residue:233
BDBM50384339
NameBDBM50384339
Synonyms:CHEMBL2031008 | US9346795, 329
TypeSmall organic molecule
Emp. Form.C38H38Cl2N6O4S
Mol. Mass.745.717
SMILESCCCN(CCC)c1ncc(Cl)c(n1)-c1ccc(cc1C(=O)N1Cc2ccccc2C[C@H]1CN)C(=O)NS(=O)(=O)c1ccc2cccc(Cl)c2c1