Reaction Details
TargetProlyl endopeptidase FAP
LigandBDBM50434188
Substrate/Competitorn/a
Meas. Tech.Enzymatic Assay
pH8.3±n/a
Temperature310.15±n/a K
IC50 10.3±0.4 nM
Commentsextracted
Citation Jansen, KDe Meester, IHeirbaut, LCheng, JDJoossens, JAugustyns, KVan Der Veken, P FAP inhibitors US Patent US9346814 Publication Date 5/24/2016
 
Prolyl endopeptidase FAP
Name:Prolyl endopeptidase FAP
Type:Enzyme
Mol. Mass.:87949.14
Organism:Mus musculus (Mouse)
Description:P97321
Residue:761
BDBM50434188
NameBDBM50434188
Synonyms:CHEMBL2385281 | US9346814, Cmpd No 2 Example 3
TypeSmall organic molecule
Emp. Form.C17H16N4O2
Mol. Mass.308.3345
SMILESO=C(CNC(=O)c1ccnc2ccccc12)N1CCC[C@H]1C#N