Reaction Details
TargetPlasmepsin II
LigandBDBM234508
Substrate/Competitorn/a
Meas. Tech.Enzyme Inhibition Assay
pH4.5±n/a
Temperature298.15±n/a K
IC50 6±n/a nM
Commentsextracted
Citation Chen, XDing, KMeyers, MJTortorella, MDXu, J Compositions and methods for the treatment of malaria US Patent US9353089 Publication Date 5/31/2016
 
Plasmepsin II
Name:Plasmepsin II
Type:Enzyme
Mol. Mass.:51482.09
Organism:Plasmodium falciparum
Description:P46925
Residue:453
BDBM234508
NameBDBM234508
Synonyms:US9353089, 155
TypeSmall organic molecule
Emp. Form.C21H21Cl2N3O
Mol. Mass.402.317
SMILESClc1ccc(cc1)C1(NC(=N)N(C2CCCCC2)C1=O)c1ccc(Cl)cc1