Reaction Details
TargetPlasmepsin II
LigandBDBM234533
Substrate/Competitorn/a
Meas. Tech.Enzyme Inhibition Assay
pH4.5±n/a
Temperature298.15±n/a K
IC50 9.62±n/a nM
Commentsextracted
Citation Chen, XDing, KMeyers, MJTortorella, MDXu, J Compositions and methods for the treatment of malaria US Patent US9353089 Publication Date 5/31/2016
 
Plasmepsin II
Name:Plasmepsin II
Type:Enzyme
Mol. Mass.:51482.09
Organism:Plasmodium falciparum
Description:P46925
Residue:453
BDBM234533
NameBDBM234533
Synonyms:US9353089, 219
TypeSmall organic molecule
Emp. Form.C23H22N4O3
Mol. Mass.402.4458
SMILESCOc1ccc(cc1)C1(NC(=N)N(Cc2cccnc2)C1=O)c1ccc(OC)cc1