Reaction Details
TargetPlasmepsin II
LigandBDBM234544
Substrate/Competitorn/a
Meas. Tech.Enzyme Inhibition Assay
pH4.5±n/a
Temperature298.15±n/a K
IC50 2.76±n/a nM
Commentsextracted
Citation Chen, XDing, KMeyers, MJTortorella, MDXu, J Compositions and methods for the treatment of malaria US Patent US9353089 Publication Date 5/31/2016
 
Plasmepsin II
Name:Plasmepsin II
Type:Enzyme
Mol. Mass.:51482.09
Organism:Plasmodium falciparum
Description:P46925
Residue:453
BDBM234544
NameBDBM234544
Synonyms:US9353089, 278
TypeSmall organic molecule
Emp. Form.C26H27N3O3
Mol. Mass.429.5109
SMILESCOc1ccc(cc1)C1(NC(=N)N(Cc2c(C)cccc2C)C1=O)c1ccc(OC)cc1