Reaction Details
TargetCellular tumor antigen p53 [18-26]/E3 ubiquitin-protein ligase Mdm2 [2-188]
LigandBDBM236265
Substrate/Competitorn/a
Meas. Tech.Time Resolved Fluorescence Energy Transfer (TR-FRET) Assay
Temperature298.15±n/a K
IC50 0.095±n/a nM
Commentsextracted
Citation Cotesta, SFuret, PGuagnano, VHolzer, PKallen, JMah, RMasuya, KSchlapbach, AStutz, SVaupel, A Pyrrolopyrrolidinone compounds US Patent US9365576 Publication Date 6/14/2016
 
Cellular tumor antigen p53 [18-26]/E3 ubiquitin-protein ligase Mdm2 [2-188]
Name:Cellular tumor antigen p53 [18-26]/E3 ubiquitin-protein ligase Mdm2 [2-188]
Synonyms:p53-MDM2
Type:Protein
Mol. Mass.:n/a
Description:n/a
Components:This complex has 2 components.
Component 1
Name:Cellular tumor antigen p53 [18-26]
Type:Protein
Mol. Mass.:1122.31
Organism:Homo sapiens (Human)
Description:aa 18-26
Residue:9
TFSDLWKLL
Component 2
Name:E3 ubiquitin-protein ligase Mdm2 [2-188]
Synonyms:E3 ubiquitin-protein ligase Mdm2 MDM2_HUMAN
Type:Protein
Mol. Mass.:21187.98
Organism:Homo sapiens (Human)
Description:aa 2-188
Residue:187
BDBM236265
NameBDBM236265
Synonyms:US9365576, 18
TypeSmall organic molecule
Emp. Form.C31H29Cl2N3O3
Mol. Mass.562.486
SMILESCNC(=O)c1ccc(OC)c(c1)-c1cc2C(=O)N([C@H](c2n1C(C)C)c1ccc(Cl)cc1)c1cc(Cl)ccc1C