Reaction Details
TargetCellular tumor antigen p53 [18-26]/E3 ubiquitin-protein ligase Mdm2 [2-188]
LigandBDBM236473
Substrate/Competitorn/a
Meas. Tech.Time Resolved Fluorescence Energy Transfer (TR-FRET) Assay
Temperature298.15±n/a K
IC50 0.078±n/a nM
Commentsextracted
Citation Cotesta, SFuret, PGuagnano, VHolzer, PKallen, JMah, RMasuya, KSchlapbach, AStutz, SVaupel, A Pyrrolopyrrolidinone compounds US Patent US9365576 Publication Date 6/14/2016
 
Cellular tumor antigen p53 [18-26]/E3 ubiquitin-protein ligase Mdm2 [2-188]
Name:Cellular tumor antigen p53 [18-26]/E3 ubiquitin-protein ligase Mdm2 [2-188]
Synonyms:p53-MDM2
Type:Protein
Mol. Mass.:n/a
Description:n/a
Components:This complex has 2 components.
Component 1
Name:Cellular tumor antigen p53 [18-26]
Type:Protein
Mol. Mass.:1122.31
Organism:Homo sapiens (Human)
Description:aa 18-26
Residue:9
TFSDLWKLL
Component 2
Name:E3 ubiquitin-protein ligase Mdm2 [2-188]
Synonyms:E3 ubiquitin-protein ligase Mdm2 MDM2_HUMAN
Type:Protein
Mol. Mass.:21187.98
Organism:Homo sapiens (Human)
Description:aa 2-188
Residue:187
BDBM236473
NameBDBM236473
Synonyms:US9365576, 229
TypeSmall organic molecule
Emp. Form.C27H24Cl2FN5O3
Mol. Mass.556.416
SMILESCOC[C@@H](C)n1c(cc2C(=O)N([C@H](c12)c1ccc(Cl)cc1)c1ccc(F)c(Cl)c1)-c1cnc(N)nc1OC