Reaction Details
TargetBeta-glucuronidase
LigandBDBM152586
Substrate/Competitorn/a
Meas. Tech.β-Glucuronidase Inhibition Assay
pH7±0
Temperature310.15±0 K
IC50 4.84e+4±n/a nM
Citation Choudhary, MIZafar, SKhan, NTAhmad, SNoreen, SMarasini, BPAl-Khedhairy, AAAtta-Ur-Rahman, null Biotransformation of dehydroepiandrosterone with Macrophomina phaseolina and ß-glucuronidase inhibitory activity of transformed products. J Enzyme Inhib Med Chem27:348-55 (2012) 
 
Beta-glucuronidase
Name:Beta-glucuronidase
Type:Protein
Mol. Mass.:68431.57
Organism:Escherichia coli (Enterobacteria)
Description:P05804
Residue:603
BDBM152586
NameBDBM152586
Synonyms:D-Saccharic acid 1,4 lactone D-Saccharic acid 1,4-lactone | D-saccharic acid-1,4-lactone
TypeSmall organic molecule
Emp. Form.C6H8O7
Mol. Mass.192.1235
SMILESOC(C1OC(=O)C(O)C1O)C(O)=O