Reaction Details
TargetRAF proto-oncogene serine/threonine-protein kinase [Y340D,Y341D]
LigandBDBM238351
Substrate/Competitorn/a
Meas. Tech.Inhibition Assay
IC50 94.8±n/a nM
Citation Bae, IHHan, SMKwak, EJAhn, YGSuh, KH Isoquinoline-5-carboxamide derivative having inhibitory activity for protein kinase US Patent US9388165 Publication Date 7/12/2016
 
RAF proto-oncogene serine/threonine-protein kinase [Y340D,Y341D]
Name:RAF proto-oncogene serine/threonine-protein kinase [Y340D,Y341D]
Type:Serine/threonine-protein kinase
Mol. Mass.:72984.33
Organism:Homo sapiens (Human)
Description:P04049 Y340D Y341D
Residue:648
BDBM238351
NameBDBM238351
Synonyms:US9388165, 11
TypeSmall organic molecule
Emp. Form.C29H23F3N6O2
Mol. Mass.544.5271
SMILESCc1cn(cn1)-c1cc(NC(=O)c2ccc(C)c(NC(=O)c3cccc4c(N)nccc34)c2)cc(c1)C(F)(F)F