Reaction Details
TargetHistone deacetylase 4
LigandBDBM293886
Substrate/Competitorn/a
Meas. Tech.Biochemical HDAC-4 Assay
IC50 10.00±n/a nM
Citation Dominguez, CMuñoz-Sanjuán, IMaillard, MLuckhurst, CAJarvis, REBürli, RWAllen, DRHaughan, AFBreccia, PVater, HDStott, AJPenrose, SDWall, MSaville-Stones, EAWishart, GHughes, SJ Histone deacetylase inhibitors and compositions and methods of use thereof US Patent US10106535 Publication Date 10/23/2018
 
Histone deacetylase 4
Name:Histone deacetylase 4
Type:Enzyme
Mol. Mass.:119049.39
Organism:Homo sapiens (Human)
Description:P56524
Residue:1084
BDBM293886
NameBDBM293886
Synonyms:(S)-1-(3-Fluoro-2- methylphenyl)-N- hydroxy-3-(quinoxalin-6- yl)cyclopent-2- enecarboxamide US9617259, 12
TypeSmall organic molecule
Emp. Form.C21H18FN3O2
Mol. Mass.363.3849
SMILESCc1c(F)cccc1[C@@]1(CCC(=C1)c1ccc2nccnc2c1)C(=O)NO