Reaction Details
TargetHistone deacetylase 4
LigandBDBM293901
Substrate/Competitorn/a
Meas. Tech.Biochemical HDAC-4 Assay
IC50 20.0±n/a nM
Citation Dominguez, CMuñoz-Sanjuán, IMaillard, MLuckhurst, CAJarvis, REBürli, RWAllen, DRHaughan, AFBreccia, PVater, HDStott, AJPenrose, SDWall, MSaville-Stones, EAWishart, GHughes, SJ Histone deacetylase inhibitors and compositions and methods of use thereof US Patent US10106535 Publication Date 10/23/2018
 
Histone deacetylase 4
Name:Histone deacetylase 4
Type:Enzyme
Mol. Mass.:119049.39
Organism:Homo sapiens (Human)
Description:P56524
Residue:1084
BDBM293901
NameBDBM293901
Synonyms:(S)-1-(3-Fluoro-2- methylphenyl)-N- hydroxy-3-(1-methyl-1H- pyrazol-5-yl)cyclopent-2- enecarboxamide US9617259, 27
TypeSmall organic molecule
Emp. Form.C17H18FN3O2
Mol. Mass.315.3421
SMILESCc1c(F)cccc1[C@@]1(CCC(=C1)c1ccnn1C)C(=O)NO