Reaction Details
TargetCannabinoid receptor 1
LigandBDBM239076
Substrate/Competitorn/a
Meas. Tech.Functional Assay
Ki 387±77 nM
Citation Prather, PLPrisinzano, TEFantegrossi, WEBrents, LKMoran, JRadominska-Pandya, AVasiljevik, T Use of the aminoalkylindole JWH-073-M4 and related compounds as neutral CB1 receptor antagonists for the treatment of alcoholism, drug abuse, obesity, and obesity-related diseases US Patent US9416103 Publication Date 8/16/2016
 
Cannabinoid receptor 1
Name:Cannabinoid receptor 1
Type:Enzyme
Mol. Mass.:52842.52
Organism:Mus musculus (Mouse)
Description:P47746
Residue:473
BDBM239076
NameBDBM239076
Synonyms:US9416103, TV-5-129
TypeSmall organic molecule
Emp. Form.C21H22FNO2
Mol. Mass.339.4033
SMILESCCCCn1cc(C(=O)Cc2ccc(F)cc2)c2cccc(OC)c12