Reaction Details
TargetCannabinoid receptor 2
LigandBDBM85804
Substrate/Competitorn/a
Meas. Tech.Functional Assay
Ki 9.8±0.9 nM
Citation Prather, PLPrisinzano, TEFantegrossi, WEBrents, LKMoran, JRadominska-Pandya, AVasiljevik, T Use of the aminoalkylindole JWH-073-M4 and related compounds as neutral CB1 receptor antagonists for the treatment of alcoholism, drug abuse, obesity, and obesity-related diseases US Patent US9416103 Publication Date 8/16/2016
 
Cannabinoid receptor 2
Name:Cannabinoid receptor 2
Type:G Protein-Coupled Receptor (GPCR)
Mol. Mass.:39690.94
Organism:Homo sapiens (Human)
Description:P34972
Residue:360
BDBM85804
NameBDBM85804
Synonyms:1-Naphthyl(1-butyl-1H-indole-3-yl)methanone US9416103, JWH-073
TypeSmall organic molecule
Emp. Form.C23H21NO
Mol. Mass.327.4189
SMILESCCCCn1cc(C(=O)c2cccc3ccccc23)c2ccccc12