Reaction Details
TargetCannabinoid receptor 2
LigandBDBM239077
Substrate/Competitorn/a
Meas. Tech.Functional Assay
Ki 10.9±3.1 nM
Citation Prather, PLPrisinzano, TEFantegrossi, WEBrents, LKMoran, JRadominska-Pandya, AVasiljevik, T Use of the aminoalkylindole JWH-073-M4 and related compounds as neutral CB1 receptor antagonists for the treatment of alcoholism, drug abuse, obesity, and obesity-related diseases US Patent US9416103 Publication Date 8/16/2016
 
Cannabinoid receptor 2
Name:Cannabinoid receptor 2
Type:G Protein-Coupled Receptor (GPCR)
Mol. Mass.:39690.94
Organism:Homo sapiens (Human)
Description:P34972
Residue:360
BDBM239077
NameBDBM239077
Synonyms:US9416103, TV-5-249
TypeSmall organic molecule
Emp. Form.C24H25NO
Mol. Mass.343.4614
SMILESCCCCn1cc(Cc2cccc3ccccc23)c2cccc(OC)c12