Reaction Details
TargetCannabinoid receptor 2
LigandBDBM239141
Substrate/Competitorn/a
Meas. Tech.Cannabinoid Receptor Binding Assay
Ki>1.0e+4±n/a nM
IC50>1.0e+4±n/a nM
Citation Taher, ATKadry, HHAllarà, MDi Marzo, VAbadi, AHAbouzid, KA Synthesis and binding study of certain 6-arylalkanamides as molecular probes for cannabinoid receptor subtypes. J Enzyme Inhib Med Chem28:436-9 (2013) 
 
Cannabinoid receptor 2
Name:Cannabinoid receptor 2
Type:G Protein-Coupled Receptor (GPCR)
Mol. Mass.:39690.94
Organism:Homo sapiens (Human)
Description:P34972
Residue:360
BDBM239141
NameBDBM239141
Synonyms:(E) Ethyl [2-(4-oxo-6-phenylhex)-5-enamido]acetate (3c)
TypeSmall organic molecule
Emp. Form.C13H15NO3
Mol. Mass.233.2631
SMILESCCOC(=O)CNC(=O)\C=C\c1ccccc1