Reaction Details
TargetCannabinoid receptor 2
LigandBDBM239143
Substrate/Competitorn/a
Meas. Tech.Cannabinoid Receptor Binding Assay
Ki>1.0e+4±n/a nM
IC50>1.0e+4±n/a nM
Citation Taher, ATKadry, HHAllarà, MDi Marzo, VAbadi, AHAbouzid, KA Synthesis and binding study of certain 6-arylalkanamides as molecular probes for cannabinoid receptor subtypes. J Enzyme Inhib Med Chem28:436-9 (2013) 
 
Cannabinoid receptor 2
Name:Cannabinoid receptor 2
Type:G Protein-Coupled Receptor (GPCR)
Mol. Mass.:39690.94
Organism:Homo sapiens (Human)
Description:P34972
Residue:360
BDBM239143
NameBDBM239143
Synonyms:(E)-N-(1,3-Dihydroxy-2-(hydroxymethylpropan-2-yl)-4-oxo-6-p-tolylhex-5-enamide (3e)
TypeSmall organic molecule
Emp. Form.C17H23NO5
Mol. Mass.321.3682
SMILESCc1ccc(\C=C\C(=O)CCC(=O)NC(CO)(CO)CO)cc1