Reaction Details
TargetCannabinoid receptor 2
LigandBDBM239150
Substrate/Competitorn/a
Meas. Tech.Cannabinoid Receptor Binding Assay
Ki>1.0e+4±n/a nM
IC50>1.0e+4±n/a nM
Citation Taher, ATKadry, HHAllarà, MDi Marzo, VAbadi, AHAbouzid, KA Synthesis and binding study of certain 6-arylalkanamides as molecular probes for cannabinoid receptor subtypes. J Enzyme Inhib Med Chem28:436-9 (2013) 
 
Cannabinoid receptor 2
Name:Cannabinoid receptor 2
Type:G Protein-Coupled Receptor (GPCR)
Mol. Mass.:39690.94
Organism:Homo sapiens (Human)
Description:P34972
Residue:360
BDBM239150
NameBDBM239150
Synonyms:(E)-4-Acetamidophenyl 4-oxo-6-phenylhex-5-enoate (3l)
TypeSmall organic molecule
Emp. Form.C20H19NO4
Mol. Mass.337.3692
SMILESCC(=O)Nc1ccc(OC(=O)CCC(=O)\C=C\c2ccccc2)cc1