Reaction Details
TargetTrace amine-associated receptor 1
LigandBDBM240676
Substrate/Competitorn/a
Meas. Tech.Radioligand Binding (mouse TAAR1)
pH7.4±n/a
Temperature310.15±n/a K
Ki 0.3±n/a nM
Commentsextracted
Citation Galley, GGhellamallah, CNorcross, RPflieger, P Triazole carboxamides and uses thereof US Patent US9416127 Publication Date 8/16/2016
 
Trace amine-associated receptor 1
Name:Trace amine-associated receptor 1
Type:Protein
Mol. Mass.:37635.41
Organism:Mus musculus (Mouse)
Description:Q923Y8
Residue:332
BDBM240676
NameBDBM240676
Synonyms:US9416127, 13
TypeSmall organic molecule
Emp. Form.C20H18F3N5O2
Mol. Mass.417.3844
SMILESFC(F)(F)c1cccc(c1)-n1ncc(n1)C(=O)Nc1ccc(cc1)[C@H]1CNCCO1