Reaction Details
TargetTrace amine-associated receptor 1
LigandBDBM240677
Substrate/Competitorn/a
Meas. Tech.Radioligand Binding (mouse TAAR1)
pH7.4±n/a
Temperature310.15±n/a K
Ki 0.4±n/a nM
Commentsextracted
Citation Galley, GGhellamallah, CNorcross, RPflieger, P Triazole carboxamides and uses thereof US Patent US9416127 Publication Date 8/16/2016
 
Trace amine-associated receptor 1
Name:Trace amine-associated receptor 1
Type:Protein
Mol. Mass.:37635.41
Organism:Mus musculus (Mouse)
Description:Q923Y8
Residue:332
BDBM240677
NameBDBM240677
Synonyms:US9416127, 14 | US9416127, 15
TypeSmall organic molecule
Emp. Form.C20H18F3N5O3
Mol. Mass.433.3838
SMILESFC(F)(F)Oc1ccc(cc1)-n1ncc(n1)C(=O)Nc1ccc(cc1)[C@H]1CNCCO1