Reaction Details
TargetAtypical chemokine receptor 3
LigandBDBM243723
Substrate/Competitorn/a
Meas. Tech.In Vitro Assay
Temperature310.15±n/a K
EC50 1±n/a nM
Commentsextracted
Citation Fretz, HGude, MGuerry, PKimmerlin, TLehembre, FPfeifer, TValdenaire, A 1-[m-carboxamido(hetero)aryl-methyl]-heterocyclyl-carboxamide derivatives US Patent US9428456 Publication Date 8/30/2016
 
Atypical chemokine receptor 3
Name:Atypical chemokine receptor 3
Type:Enzyme
Mol. Mass.:41498.84
Organism:Homo sapiens (Human)
Description:P25106
Residue:362
BDBM243723
NameBDBM243723
Synonyms:US9428456, 1.341
TypeSmall organic molecule
Emp. Form.C25H31F3N4O2
Mol. Mass.476.5344
SMILESCCC(C)(C)NC(=O)C1CCN(Cc2cccc(NC(=O)c3ccc(cn3)C(F)(F)F)c2)CC1