Reaction Details
TargetCytochrome b-245 heavy chain
LigandBDBM244079
Substrate/Competitorn/a
Meas. Tech.Activity Assay
IC50 1500000000±n/a nM
Citation Ganesh, TSun, ASmith, SMLambeth, JD Piperazine derivatives, compositions, and uses related thereto US Patent US9428478 Publication Date 8/30/2016
 
Cytochrome b-245 heavy chain
Name:Cytochrome b-245 heavy chain
Type:Enzyme
Mol. Mass.:65355.82
Organism:Homo sapiens (Human)
Description:P04839
Residue:570
BDBM244079
NameBDBM244079
Synonyms:US9428478, TG6-205-2
TypeSmall organic molecule
Emp. Form.C20H18F3N3O3
Mol. Mass.405.3704
SMILESOc1ccc2[nH]c(cc2c1)C(=O)N1CCN(CC1)c1ccc(OC(F)(F)F)cc1